Hallo,
Hab einen CentOS 6 root Server mit Plesk 12 und Php 5.6.
Nun habe ich nach dieser Anleitung Grive installieren wollen: http://nerdspiral.com/howto-ein-google-drive-client-fur-linux-grive-unter-fedora/
klappt auch ganz gut. Abhängigkeiten sind installiert, yum Update gemacht und grive von Github geladen.
Mit. /configure und cmake . Installation vorbereitet.
Danach folgt cmake. Dabei bringt dies mit folgender Meldung ab.
Woran liegt der Fehler? Boost Package ist auf 1.55.0.
Lg Lars
Hab einen CentOS 6 root Server mit Plesk 12 und Php 5.6.
Nun habe ich nach dieser Anleitung Grive installieren wollen: http://nerdspiral.com/howto-ein-google-drive-client-fur-linux-grive-unter-fedora/
klappt auch ganz gut. Abhängigkeiten sind installiert, yum Update gemacht und grive von Github geladen.
Mit. /configure und cmake . Installation vorbereitet.
Danach folgt cmake. Dabei bringt dies mit folgender Meldung ab.
Code:
[root@h2124583 grive]# make
[ 1%] Building CXX object libgrive/CMakeFiles/grive.dir/src/drive/Resource.cc.o
/home/grive/libgrive/src/drive/Resource.cc: In member function »void gr::v1::Resource::FromLocal(const gr::DateTime&)«:
/home/grive/libgrive/src/drive/Resource.cc:272: Fehler: »struct std::basic_string<char, std::char_traits<char>, std::allocator<char> >« hat kein Element namens »string«
make[2]: *** [libgrive/CMakeFiles/grive.dir/src/drive/Resource.cc.o] Fehler 1make[1]: *** [libgrive/CMakeFiles/grive.dir/all] Fehler 2
make: *** [all] Fehler 2
Woran liegt der Fehler? Boost Package ist auf 1.55.0.
Lg Lars