• This forum has a zero tolerance policy regarding spam. If you register here to publish advertising, your user account will be deleted without further questions.

Lufs auf Strato Server

society

Registered User
Hallo jungs,

hat jemand von euch mal LUFS zum laufen gebracht?
Bekomme beim make install diesen Fehler:

Code:
hxxxxx:~/install/lufs/lufs-0.9.7 # make install
Making install in kernel
make[1]: Entering directory `/root/install/lufs/lufs-0.9.7/kernel'
Making install in Linux
make[2]: Entering directory `/root/install/lufs/lufs-0.9.7/kernel/Linux'
Making install in 2.4
make[3]: Entering directory `/root/install/lufs/lufs-0.9.7/kernel/Linux/2.4'
make[4]: Entering directory `/root/install/lufs/lufs-0.9.7/kernel/Linux/2.4'
make[4]: Nothing to be done for `install-exec-am'.
/bin/sh ../../../config/mkinstalldirs /lib/modules/2.4.25/kernel/fs/lufs
mkdir -p -- /lib/modules/2.4.25/kernel/fs/lufs
  /bin/sh ../../../libtool --mode=install /usr/bin/install -c lufs.o /lib/module
s/2.4.25/kernel/fs/lufs/lufs.o
/usr/bin/install -c lufs.o /lib/modules/2.4.25/kernel/fs/lufs/lufs.o
make  install-data-hook
make[5]: Entering directory `/root/install/lufs/lufs-0.9.7/kernel/Linux/2.4'
depmod -aq
if [ "`lsmod | grep lufs`" ]; then rmmod lufs; fi
modprobe lufs
/lib/modules/2.4.25/kernel/fs/lufs/lufs.o: unresolved symbol preempt_schedule
/lib/modules/2.4.25/kernel/fs/lufs/lufs.o: unresolved symbol kunmap_high
/lib/modules/2.4.25/kernel/fs/lufs/lufs.o: unresolved symbol put_cmsg
/lib/modules/2.4.25/kernel/fs/lufs/lufs.o: unresolved symbol generic_file_llseek
/lib/modules/2.4.25/kernel/fs/lufs/lufs.o: unresolved symbol generic_file_write
/lib/modules/2.4.25/kernel/fs/lufs/lufs.o: unresolved symbol unlock_page
/lib/modules/2.4.25/kernel/fs/lufs/lufs.o: unresolved symbol clear_inode
/lib/modules/2.4.25/kernel/fs/lufs/lufs.o: unresolved symbol kmalloc
/lib/modules/2.4.25/kernel/fs/lufs/lufs.o: unresolved symbol kernel_flag_cacheli
ne
/lib/modules/2.4.25/kernel/fs/lufs/lufs.o: unresolved symbol new_inode
/lib/modules/2.4.25/kernel/fs/lufs/lufs.o: unresolved symbol generic_read_dir
/lib/modules/2.4.25/kernel/fs/lufs/lufs.o: unresolved symbol scm_detach_fds
/lib/modules/2.4.25/kernel/fs/lufs/lufs.o: unresolved symbol unregister_filesyst
em
/lib/modules/2.4.25/kernel/fs/lufs/lufs.o: unresolved symbol vfs_readlink
/lib/modules/2.4.25/kernel/fs/lufs/lufs.o: unresolved symbol dcache_lock
/lib/modules/2.4.25/kernel/fs/lufs/lufs.o: unresolved symbol force_delete
/lib/modules/2.4.25/kernel/fs/lufs/lufs.o: unresolved symbol find_inode_number
/lib/modules/2.4.25/kernel/fs/lufs/lufs.o: unresolved symbol generic_file_mmap
/lib/modules/2.4.25/kernel/fs/lufs/lufs.o: unresolved symbol is_bad_inode
/lib/modules/2.4.25/kernel/fs/lufs/lufs.o: unresolved symbol d_rehash
/lib/modules/2.4.25/kernel/fs/lufs/lufs.o: unresolved symbol make_bad_inode
/lib/modules/2.4.25/kernel/fs/lufs/lufs.o: unresolved symbol __out_of_line_bug
/lib/modules/2.4.25/kernel/fs/lufs/lufs.o: unresolved symbol generic_file_read
/lib/modules/2.4.25/kernel/fs/lufs/lufs.o: unresolved symbol generic_file_open
/lib/modules/2.4.25/kernel/fs/lufs/lufs.o: unresolved symbol register_filesystem
/lib/modules/2.4.25/kernel/fs/lufs/lufs.o: unresolved symbol invalidate_inode_pa
ges
/lib/modules/2.4.25/kernel/fs/lufs/lufs.o: unresolved symbol d_alloc_root
/lib/modules/2.4.25/kernel/fs/lufs/lufs.o: unresolved symbol kill_proc_info
/lib/modules/2.4.25/kernel/fs/lufs/lufs.o: unresolved symbol kfree
/lib/modules/2.4.25/kernel/fs/lufs/lufs.o: unresolved symbol highmem_start_page
/lib/modules/2.4.25/kernel/fs/lufs/lufs.o: unresolved symbol iunique
/lib/modules/2.4.25/kernel/fs/lufs/lufs.o: unresolved symbol vfs_follow_link
/lib/modules/2.4.25/kernel/fs/lufs/lufs.o: unresolved symbol __scm_destroy
/lib/modules/2.4.25/kernel/fs/lufs/lufs.o: unresolved symbol xtime
/lib/modules/2.4.25/kernel/fs/lufs/lufs.o: unresolved symbol sock_release
/lib/modules/2.4.25/kernel/fs/lufs/lufs.o: unresolved symbol simple_strtoul
/lib/modules/2.4.25/kernel/fs/lufs/lufs.o: unresolved symbol sock_create
/lib/modules/2.4.25/kernel/fs/lufs/lufs.o: unresolved symbol jiffies
/lib/modules/2.4.25/kernel/fs/lufs/lufs.o: unresolved symbol d_instantiate
/lib/modules/2.4.25/kernel/fs/lufs/lufs.o: unresolved symbol insert_inode_hash
/lib/modules/2.4.25/kernel/fs/lufs/lufs.o: unresolved symbol kmap_high
/lib/modules/2.4.25/kernel/fs/lufs/lufs.o: unresolved symbol __free_pages
/lib/modules/2.4.25/kernel/fs/lufs/lufs.o: unresolved symbol strtok
/lib/modules/2.4.25/kernel/fs/lufs/lufs.o: unresolved symbol printk
/lib/modules/2.4.25/kernel/fs/lufs/lufs.o: unresolved symbol irq_stat
/lib/modules/2.4.25/kernel/fs/lufs/lufs.o: unresolved symbol __scm_send
/lib/modules/2.4.25/kernel/fs/lufs/lufs.o: insmod /lib/modules/2.4.25/kernel/fs/
lufs/lufs.o failed
/lib/modules/2.4.25/kernel/fs/lufs/lufs.o: insmod lufs failed
make[5]: *** [install-data-hook] Error 255
make[5]: Leaving directory `/root/install/lufs/lufs-0.9.7/kernel/Linux/2.4'
make[4]: *** [install-data-am] Error 2
make[4]: Leaving directory `/root/install/lufs/lufs-0.9.7/kernel/Linux/2.4'
make[3]: *** [install-am] Error 2
make[3]: Leaving directory `/root/install/lufs/lufs-0.9.7/kernel/Linux/2.4'
make[2]: *** [install-recursive] Error 1
make[2]: Leaving directory `/root/install/lufs/lufs-0.9.7/kernel/Linux'
make[1]: *** [install-recursive] Error 1
make[1]: Leaving directory `/root/install/lufs/lufs-0.9.7/kernel'
make: *** [install-recursive] Error 1
hxxxxx:~/install/lufs/lufs-0.9.7 #

Configure und Make liefen ohne Probleme...
Kernel ist der der bei Strato dabei war, kann man auch einen eigenen machen oder den von Suse selber nehmen?
 
Hi - schau dir mal den Beitrag hier bei rootforum an.

Evtl. hilft dir das weiter ...

Zum kompilieren von lufs sind die Quellen des verwendeten Kernels erforderlich. Diese müssen sich in /usr/src/linux befinden. Download z.B. unter www.kernel.org.

Dein verwendeter Kernel von Strato liegt unter /usr/src/linux-2.4.25/ ... im Normalfall liegen die dann parallel noch unter ~linux im gleichen Verzeichnis /usr/src/ ... wenn dies nicht der Fall ist, dann kopiere die da mal hin.
 
Habe doch gesagt das Configure und Make liefen *G*
/usr/src/linux ist gelinkt auf den Strato Kernel Src linux-2.4.25
 
Habe sogar es probiert mit meinen eigenen Kernel zu bauen... ging auch nicht, gleicher Fehler.
Ich benutze nun fsftp geht genauso gut.
 
Back
Top